{"text_format":"1","workbook":"xlsx","n_sheets":9,"sheets":["Instructions","Data Entry","Form 714 Data","Adjustments","Variable Bias Supplemental Info","BA Form 2 Event Data","TimeZone Ref","Event Frequency Graphs","Frequency Response Initiative"],"not_rendered":{"charts":7,"images":0,"macros":1,"external_links":0,"defined_names":10,"comments":1,"pivot_tables":0},"unopened":[],"bounds":{"document_bytes":16777216,"sheet_cells":100000,"rows_first":2000,"rows_last":500,"rows_between":2000,"halvings":0,"cell_chars":16384,"cell_head_chars":4096},"cells_cut":0,"cells_raw":0,"read":"whole","date_system":"1900"}

{"sheet":"Instructions","index":0,"n_rows":31,"n_cols":2,"rows_kept":31,"cut":false,"hidden":false,"merged":[[30,1,30,8],[2,1,2,8],[4,1,4,8],[7,1,7,8]]}
["Instructions"," "]
[null," "]
["Step 1","Enter data in all green cells on the \"Data Entry\" worksheet.  Cell G1 with the BA name.  Cells R11 through R13 with contact information.  Cell R24 with BA Bias Type, Fixed or Variable."]
[]
["Step 2","For identified events in column C of the \"Data Entry\" worksheet, collect data and complete one FRS Form 2 workbook for each event in the list."]
[null,"Detailed Instructions for utilizing the \"Adjustments\" are located on the \"Adjustments\" worksheet below the table."]
{"$rows_left_out":26}
{"sheet":"Data Entry","index":1,"n_rows":74,"n_cols":59,"rows_kept":74,"cut":false,"hidden":false,"merged":[[32,18,33,18],[32,19,33,19],[0,52,0,58],[73,6,73,14],[65,6,65,14],[67,6,67,14],[69,6,69,14],[71,6,71,14],[11,44,11,48],[0,21,0,22],[0,8,0,16],[12,44,12,48],[23,44,23,48],[14,44,14,48],[15,44,15,48],[16,44,16,48],[13,44,13,48],[4,44,4,48],[5,44,5,48],[6,44,6,48],[7,44,7,48],[8,44,8,48],[9,44,9,48],[24,44,24,48],[25,44,25,48],[26,44,26,48],[27,44,27,48],[28,44,28,48],[49,44,49,48],[50,44,50,48],[47,44,47,48],[32,44,32,48],[35,44,35,48],[36,44,36,48],[33,44,33,48],[43,44,43,48],[44,44,44,48],[45,44,45,48],[40,44,40,48],[41,44,41,48],[42,44,42,48],[34,44,34,48],[37,44,37,48],[38,44,38,48],[1,57,1,58],[2,57,2,58],[46,44,46,48],[30,19,31,19],[48,44,48,48],[31,44,31,48],[39,44,39,48],[10,44,10,48],[29,44,29,48],[30,44,30,48],[17,44,17,48],[18,44,18,48],[19,44,19,48],[20,44,20,48],[21,44,21,48],[22,44,22,48]]}
[null,null,null,null,null,"Balancing Authority","HQT",null,"NERC FRS FORM 1 20 to 52 second Value B",null,null,null,null,null,null,null,null,null,"Enter Addition Data in column W ==>",null,null,"Information",null," Select Reason(s) for adjustment",null,null,null,null,null,null,null,null,null,null,null,null,null,null,null,null,null,null,null,null,null,null,null,null,null,null,null,null,"Columns BA, BB, BC, BD, BE, BF and BG are reserved for calculation of the linear regression."]
["Event","UTC (t-0)","Date/Time (t-0)","Time","Date/Time (t-0)","BA",null,"BA ","BA","Relay Lmt"," Value \"A\" Information",null," Value \"B\" Information",null,"SEFRD (FRM)",null,"Exclude for",null,"Enter Data in Green Highlighted Cells",null,null," Value \"A\""," Value \"B\"",null,null,null,null,null,null,null,null,null,null,null,null,null,null,null,null,null,null,null,null,null,null,null,null,null,null,null,null,null,"BA Delta","10 X BA","10 X BA","SEFRDB","SEFRDR","Regression"]
[null,null,null,null,null,"Time",null,null,"Bias","R1",null,null,null,null,"for Bias","for R1",null,null,null,null,null,null,null,null,null,null,null,null,null,null,null,null,null,null,null,null,null,null,null,null,null,null,null,null,null,null,null,null,null,null,null,null,"NAI","DelFreq","DelFreq","(MW/0.1Hz)","(MW/0.1Hz)","Statistics"]
["Number","Date / Time\n(MM/DD/YY HH:MM:SS)","(Central Prevailing)","Zone","BA Time","Zone","DelFreq","Time","DelFreq","DelFreq","MW/Load Lost","Adjustment","MW/Load Lost","Adjustment","(MW/0.1Hz)","(MW/0.1Hz)","data error *",{"$f":"S25*100","v":0.89999999999999991},"Send copy to:","Chris.Scheetz@nerc.net",null,"Load","Load","Reason(s)",null,null,null,null,null,null,null,null,null,null,null,null,null,null,null,null,null,null,null,null,null,null,null,null,null,null,null,null,null,"For Bias","For R1",null,null,"For Bias"]
[1,{"$f":"IF(C5=\" \",\" \",C5+LOOKUP(D5,TimeZones,'TimeZone Ref'!C$2:C$11))","v":"06:00:00"},null,"CST",{"$f":"IF(C5=\" \",\" \",B5-LOOKUP(F5,TimeZones,'TimeZone Ref'!C$2:C$11))","v":"01:00:00"},"CDT",null,{"$f":"'BA Form 2 Event Data'!E8","v":"00:00:00"},{"$f":"'BA Form 2 Event Data'!$U8-'BA Form 2 Event Data'!$J8","v":0},{"$f":"IF('Data Entry'!G5<0,(IF('Data Entry'!S$9=\"Eastern\",(IF('BA Form 2 Event Data'!U8<'Data Entry'!AQ$65,'Data Entry'!AQ$65-'BA Form 2 Event Data'!J8,'BA Form 2 Event Data'!U8-'BA Form 2 Event Data'!J8)),(IF('BA Form 2 Event Data'!U8<'Data Entry'!AQ$66,'Data Entry'!AQ$66-'BA Form 2 Event Data'!J8,'BA Form 2 Event Data'!U8-'BA Form 2 Event Data'!J8)))),(IF('Data Entry'!S$9=\"Eastern\",(IF('BA Form 2 Event Data'!U8>'Data Entry'!AR$65,'Data Entry'!AR$65-'BA Form 2 Event Data'!J8,'BA Form 2 Event Data'!U8-'BA Form 2 Event Data'!J8)),(IF('BA Form 2 Event Data'!U8>'Data Entry'!AR$66,'Data Entry'!AR$66-'BA Form 2 Event Data'!J8,'BA Form 2 Event Data'!U8-'BA Form 2 Event Data'!J8)))))","v":0},{"$f":"'BA Form 2 Event Data'!V8","v":0},{"$f":"IF(CELL(\"type\",Adjustments!$V4) = \"v\",(Adjustments!$D4+Adjustments!$G4+Adjustments!$J4+Adjustments!$M4+Adjustments!$S4),0)","v":0},{"$f":"'BA Form 2 Event Data'!K8","v":0},{"$f":"IF(CELL(\"type\",Adjustments!$V4) = \"v\",(Adjustments!$E4+Adjustments!$H4+Adjustments!$K4+Adjustments!$N4+Adjustments!$Q4+Adjustments!$T4),0)","v":0},{"$f":"IF($Q5=\"y\", \"\",IF(CELL(\"type\",$I5) = \"v\",(($M5-$N5)-($K5-$L5))/(10*$I5),\"\"))","v":{"$error":"#DIV/0!"}},{"$f":"IF($Q5=\"y\", \"\",IF(CELL(\"type\",$I5) = \"v\",(($M5-$N5)-($K5-$L5))/(10*(IF(S$9=\"Eastern\",(IF('BA Form 2 Event Data'!U8<AQ$65,AQ$65,IF('BA Form 2 Event Data'!U8>AR$65,AR$65,'BA Form 2 Event Data'!U8-'BA Form 2 Event Data'!J8))),(IF(S$9=\"Western\",(IF('BA Form 2 Event Data'!U8<AQ$66,AQ$66,IF('BA Form 2 Event Data'!U8>AR$66,AR$66,'BA Form 2 Event Data'!U8-'BA Form 2 Event Data'!J8))),(IF(S$9=\"ERCOT\",(IF('BA Form 2 Event Data'!U8<AQ$67,AQ$67,IF('BA Form 2 Event Data'!U8>AR$67,AR$67,'BA Form 2 Event Data'!U8-'BA Form 2 Event Data'!J8))),(IF('BA Form 2 Event Data'!U8<AQ$68,AQ$68,IF('BA Form 2 Event Data'!U8>AR$68,AR$68,'BA Form 2 Event Data'!U8-'BA Form 2 Event Data'!J8)))))))))),\"\"))","v":0},"N",{"$f":"IF($Q5=\"y\", \"\",IF(CELL(\"type\",$I5) = \"v\",(($M5-$N5)-($K5-$L5)),\"\"))","v":0},null,null,null,{"$f":"'BA Form 2 Event Data'!S8","v":0},{"$f":"'BA Form 2 Event Data'!AG8","v":0},null,null,null,null,null,null,null,null,null,null,null,null,null,null,null,null,null,-5.7760692778103362E-2,23.246720631917327,null,null,"Dynamic schedules for joint-owned units (DS)",null,null,null,null,null,null,null,0,0,0,{"$error":"#DIV/0!"},0,{"$f":"LINEST(BA5:BA16,BB5:BB16,0,1)","v":0},0]
[2,{"$f":"IF(C6=\" \",\" \",C6+LOOKUP(D6,TimeZones,'TimeZone Ref'!C$2:C$11))","v":"06:00:00"},null,"CST",{"$f":"IF(C6=\" \",\" \",B6-LOOKUP(F6,TimeZones,'TimeZone Ref'!C$2:C$11))","v":"01:00:00"},"CDT",null,{"$f":"'BA Form 2 Event Data'!E9","v":"00:00:00"},{"$f":"'BA Form 2 Event Data'!U9-'BA Form 2 Event Data'!J9","v":0},{"$f":"IF('Data Entry'!G6<0,(IF('Data Entry'!S$9=\"Eastern\",(IF('BA Form 2 Event Data'!U9<'Data Entry'!AQ$65,'Data Entry'!AQ$65-'BA Form 2 Event Data'!J9,'BA Form 2 Event Data'!U9-'BA Form 2 Event Data'!J9)),(IF('BA Form 2 Event Data'!U9<'Data Entry'!AQ$66,'Data Entry'!AQ$66-'BA Form 2 Event Data'!J9,'BA Form 2 Event Data'!U9-'BA Form 2 Event Data'!J9)))),(IF('Data Entry'!S$9=\"Eastern\",(IF('BA Form 2 Event Data'!U9>'Data Entry'!AR$65,'Data Entry'!AR$65-'BA Form 2 Event Data'!J9,'BA Form 2 Event Data'!U9-'BA Form 2 Event Data'!J9)),(IF('BA Form 2 Event Data'!U9>'Data Entry'!AR$66,'Data Entry'!AR$66-'BA Form 2 Event Data'!J9,'BA Form 2 Event Data'!U9-'BA Form 2 Event Data'!J9)))))","v":0},{"$f":"'BA Form 2 Event Data'!V9","v":0},{"$f":"IF(CELL(\"type\",Adjustments!$V5) = \"v\",(Adjustments!$D5+Adjustments!$G5+Adjustments!$J5+Adjustments!$M5+Adjustments!$S5),0)","v":0},{"$f":"'BA Form 2 Event Data'!K9","v":0},{"$f":"IF(CELL(\"type\",Adjustments!$V5) = \"v\",(Adjustments!$E5+Adjustments!$H5+Adjustments!$K5+Adjustments!$N5+Adjustments!$Q5+Adjustments!$T5),0)","v":0},{"$f":"IF($Q6=\"y\", \"\",IF(CELL(\"type\",$I6) = \"v\",(($M6-$N6)-($K6-$L6))/(10*$I6),\"\"))","v":{"$error":"#DIV/0!"}},{"$f":"IF($Q6=\"y\", \"\",IF(CELL(\"type\",$I6) = \"v\",(($M6-$N6)-($K6-$L6))/(10*(IF(S$9=\"Eastern\",(IF('BA Form 2 Event Data'!U9<AQ$65,AQ$65,IF('BA Form 2 Event Data'!U9>AR$65,AR$65,'BA Form 2 Event Data'!U9-'BA Form 2 Event Data'!J9))),(IF(S$9=\"Western\",(IF('BA Form 2 Event Data'!U9<AQ$66,AQ$66,IF('BA Form 2 Event Data'!U9>AR$66,AR$66,'BA Form 2 Event Data'!U9-'BA Form 2 Event Data'!J9))),(IF(S$9=\"ERCOT\",(IF('BA Form 2 Event Data'!U9<AQ$67,AQ$67,IF('BA Form 2 Event Data'!U9>AR$67,AR$67,'BA Form 2 Event Data'!U9-'BA Form 2 Event Data'!J9))),(IF('BA Form 2 Event Data'!U9<AQ$68,AQ$68,IF('BA Form 2 Event Data'!U9>AR$68,AR$68,'BA Form 2 Event Data'!U9-'BA Form 2 Event Data'!J9)))))))))),\"\"))","v":0},"N",0,null,null,null,{"$f":"'BA Form 2 Event Data'!S9","v":0},{"$f":"'BA Form 2 Event Data'!AG9","v":0},null,null,null,null,null,null,null,null,null,null,null,null,null,null,null,null,null,-6.609326317200015E-2,27.701624461582725,null,null,"Nonconforming load (NL)",null,null,null,null,null,null,null,0,0,0,{"$error":"#DIV/0!"},0,0,{"$error":"#N/A"}]
{"$rows_left_out":69}
{"sheet":"Form 714 Data","index":2,"n_rows":21,"n_cols":7,"rows_kept":21,"cut":false,"hidden":false,"merged":[[1,1,1,2]]}
[]
[null,"Report 714 Data (in MW)"]
[null,"Part II Schedule 3"]
[]
[null,"Column (b)","Column (j)"]
[null,"Month","Peak Demand"]
{"$rows_left_out":16}
{"sheet":"Adjustments","index":3,"n_rows":54,"n_cols":22,"rows_kept":54,"cut":false,"hidden":false,"merged":[[47,2,47,19],[48,2,48,19],[60,2,60,19],[53,2,53,19],[54,2,54,19],[55,2,55,19],[56,2,56,19],[57,2,57,19],[58,2,58,19],[49,2,49,19],[50,2,50,19],[51,2,51,19],[59,2,59,19],[52,2,52,19],[1,11,2,11],[1,14,2,14],[1,17,2,17],[1,21,2,21],[45,1,45,2],[45,3,45,4],[45,6,45,7],[45,9,45,10],[45,12,45,13],[45,18,45,19],[1,5,2,5],[1,8,2,8],[1,20,2,20],[0,3,0,4],[0,6,0,7],[0,9,0,10],[0,12,0,13],[0,18,0,19]]}
[null,{"$f":"'Data Entry'!$F$1","v":"Balancing Authority"},{"$f":"'Data Entry'!$G$1","v":"HQT"},"Load Resources Tripped",null,null,"Non conforming Load",null,null,"Not Used",null,null,"Not Used",null,null,"Not Used",null,null,"Not Used",null,null,"Net Total Adjustments"]
["Event",{"$f":"'Data Entry'!$C$2","v":"Date/Time (t-0)"},null,"Value A","Value B",null,"Value A","Value B",null,"Value A","Value B",null,"Value A","Value B",null,"Value A","Value B",null,"Value A","Value B",null,"Value B 20 to 52 seconds"]
["Number",{"$f":"'Data Entry'!$C$4","v":"(Central Prevailing)"},{"$f":"'Data Entry'!$G$4","v":"DelFreq"},"Adjustment","Adjustment",null,"Adjustment","Adjustment",null,"Adjustment","Adjustment",null,"Adjustment","Adjustment",null,"Adjustment","Adjustment",null,"Adjustment","Adjustment"]
[1,{"$f":"IF(CELL(\"type\",'Data Entry'!$C5) = \"v\",'Data Entry'!$C5,\"\")","v":""},{"$f":"IF(CELL(\"type\",'Data Entry'!$G5)=\"v\",'Data Entry'!$G5,\"\")","v":""},{"$f":"'BA Form 2 Event Data'!L8","v":0},{"$f":"'BA Form 2 Event Data'!W8","v":0},null,{"$f":"'BA Form 2 Event Data'!M8","v":0},{"$f":"'BA Form 2 Event Data'!X8","v":0},null,{"$f":"'BA Form 2 Event Data'!N8","v":0},{"$f":"'BA Form 2 Event Data'!Y8","v":0},null,{"$f":"'BA Form 2 Event Data'!O8","v":0},{"$f":"'BA Form 2 Event Data'!Z8","v":0},null,{"$f":"'BA Form 2 Event Data'!P8","v":0},{"$f":"'BA Form 2 Event Data'!AA8","v":0},null,{"$f":"'BA Form 2 Event Data'!Q8","v":0},{"$f":"'BA Form 2 Event Data'!AB8","v":0},null,{"$f":"IF(CELL(\"type\",'Data Entry'!$I5) = \"v\",((E4+H4+K4+N4+Q4+T4)-(D4+G4+J4+M4+P4+S4)),\"\")","v":0}]
[2,{"$f":"IF(CELL(\"type\",'Data Entry'!$C6) = \"v\",'Data Entry'!$C6,\"\")","v":""},{"$f":"IF(CELL(\"type\",'Data Entry'!$G6)=\"v\",'Data Entry'!$G6,\"\")","v":""},{"$f":"'BA Form 2 Event Data'!L9","v":0},{"$f":"'BA Form 2 Event Data'!W9","v":0},null,{"$f":"'BA Form 2 Event Data'!M9","v":0},{"$f":"'BA Form 2 Event Data'!X9","v":0},null,{"$f":"'BA Form 2 Event Data'!N9","v":0},{"$f":"'BA Form 2 Event Data'!Y9","v":0},null,{"$f":"'BA Form 2 Event Data'!O9","v":0},{"$f":"'BA Form 2 Event Data'!Z9","v":0},null,{"$f":"'BA Form 2 Event Data'!P9","v":0},{"$f":"'BA Form 2 Event Data'!AA9","v":0},null,{"$f":"'BA Form 2 Event Data'!Q9","v":0},{"$f":"'BA Form 2 Event Data'!AB9","v":0},null,{"$f":"IF(CELL(\"type\",'Data Entry'!$I6) = \"v\",((E5+H5+K5+N5+Q5+T5)-(D5+G5+J5+M5+P5+S5)),\"\")","v":0}]
[3,{"$f":"IF(CELL(\"type\",'Data Entry'!$C7) = \"v\",'Data Entry'!$C7,\"\")","v":""},{"$f":"IF(CELL(\"type\",'Data Entry'!$G7)=\"v\",'Data Entry'!$G7,\"\")","v":""},{"$f":"'BA Form 2 Event Data'!L10","v":0},{"$f":"'BA Form 2 Event Data'!W10","v":0},null,{"$f":"'BA Form 2 Event Data'!M10","v":0},{"$f":"'BA Form 2 Event Data'!X10","v":0},null,{"$f":"'BA Form 2 Event Data'!N10","v":0},{"$f":"'BA Form 2 Event Data'!Y10","v":0},null,{"$f":"'BA Form 2 Event Data'!O10","v":0},{"$f":"'BA Form 2 Event Data'!Z10","v":0},null,{"$f":"'BA Form 2 Event Data'!P10","v":0},{"$f":"'BA Form 2 Event Data'!AA10","v":0},null,{"$f":"'BA Form 2 Event Data'!Q10","v":0},{"$f":"'BA Form 2 Event Data'!AB10","v":0},null,{"$f":"IF(CELL(\"type\",'Data Entry'!$I7) = \"v\",((E6+H6+K6+N6+Q6+T6)-(D6+G6+J6+M6+P6+S6)),\"\")","v":0}]
{"$rows_left_out":49}
{"sheet":"Variable Bias Supplemental Info","index":4,"n_rows":17,"n_cols":12,"rows_kept":17,"cut":false,"hidden":false,"merged":[]}
["Month","Minimum FBS* for month","Maximum FBS* for month","Time weighted ** average FBS* for month","Time weighted ** minimum average FBS* for month"]
["January",null,null,null,null,null,null,null,null,"Balancing Authority:",null,{"$f":"'Data Entry'!G1","v":"HQT"}]
["Feburary",null,null,null,null,null,null,null,null,{"$f":"YEAR('Data Entry'!$C$11)-1","v":1899},"Reporting period FRS Form 1 data"]
["March",null,null,null,null,null,null,null,null,0,{"$f":"J3& \" Reporting period: Balancinig Authority FRM MW/0.1 Hz, enter from FRS Form 1 for that year's FRM.  If not know enter zero.\"","v":"1899 Reporting period: Balancinig Authority FRM MW/0.1 Hz, enter from FRS Form 1 for that year's FRM.  If not know enter zero."}]
["April",null,null,null,null,null,null,null,null,0.01,{"$f":"J3&\" Reporting period: Interconnection Minimum Fixed Frequency Bias Setting % of Peak Demand or Peak Generation (Set by ERO)\"","v":"1899 Reporting period: Interconnection Minimum Fixed Frequency Bias Setting % of Peak Demand or Peak Generation (Set by ERO)"}]
["May ",null,null,null,null,null,null,null,null,null,{"$f":"J3&\" Reporting period: Your BA's Annual Peak Demand or Peak Gen for Gen only BAs from your BA Form 714.\"","v":"1899 Reporting period: Your BA's Annual Peak Demand or Peak Gen for Gen only BAs from your BA Form 714."}]
{"$rows_left_out":12}
{"sheet":"BA Form 2 Event Data","index":5,"n_rows":49,"n_cols":47,"rows_kept":49,"cut":false,"hidden":false,"merged":[]}
[null,null,null,null,null,null,null,null,null,null,null,null,null,null,null,null,null,null,null,null,null,null,null,null,null,null,null,"Average P.U. Performance",{"$f":"AVERAGE(AC8:AC49)","v":{"$error":"#DIV/0!"}},{"$f":"AVERAGE(AD8:AD49)","v":{"$error":"#DIV/0!"}},{"$error":"#DIV/0!"},null,null,null,null,{"$f":"AVERAGE(AJ8:AJ49)","v":{"$error":"#DIV/0!"}},{"$error":"#DIV/0!"},{"$error":"#DIV/0!"},{"$error":"#DIV/0!"},{"$error":"#DIV/0!"},{"$error":"#DIV/0!"},{"$error":"#DIV/0!"},{"$error":"#DIV/0!"},{"$error":"#DIV/0!"},{"$error":"#DIV/0!"}]
[null,null,null,"PasteSpecial/Values the data copied from FRS Form 2 for each event.",null,null,null,null,null,"Value A Data",null,"BA Performance",null,null,null,null,null,null,null,null,"Value B","20 to 52 second Average Period Evaluation",null,null,null,null,null,null,null,null,null,null,null,null,null,"Frequency Response Initiative - Additional Primary Frequency Response Evaluation Points"]
[null,null,null,null,null,null,null,null,null,null,null,null,"Non-",null,null,null,null,null,null,null,null,null,null,"Non-",null,null,null,null,null,null,null,null,null,null,"Average","Unadjusted","Unadjusted","Unadjusted","Unadjusted","Unadjusted","Adjusted","Adjusted","Adjusted","Adjusted","Adjusted"]
[null,null,null,"Date","A Point","FPointA","A Value","t(0) Time","C Value",null,"Contingent","Load","Conforming",null,null,null,null,"BA","BA","Bias",null,"Contingent","Load","Conforming",null,null,null,null,"Initial","Initial","Sustained","BA","BA","Bias","Bias While","PFR","PFR","PFR","PFR","PFR","PFR","PFR","PFR","PFR","PFR"]
[null,null,null,null,"Time","Hz","Hz",null,"Hz",null,"Resource","Resources","Load",null,null,null,null,"Bias","Load","Setting",null,"Resource","Resources","Load",null,null,null,null,"Performance","Performance","Performance","Bias","Load","Setting","Hz > +/-0.036","Performance","Performance","Performance","Performance","Performance","Performance","Performance","Performance","Performance","Performance","Maximum","Minimum"]
["Event","Date/Time",null,null,null,null,null,null,null,"Frequency","Lost","Tripped","Load (-)","Spare","Spare","Spare","Spare","Setting",null,"EPFR","Frequency","Lost","Tripped","Load (-)","Spare","Spare","Spare","Spare","Adjusted","Unadjusted",null,"Setting",null,"EPFR","Hz","@ T(+46)","@ T(+76)","@ T(+106)","@ T(+136)","@ T(+166)","@ T(+46)","@ T(+76)","@ T(+106)","@ T(+136)","@ T(+166)","Bias Setting","Bias Setting"]
{"$rows_left_out":44}
{"sheet":"TimeZone Ref","index":6,"n_rows":11,"n_cols":4,"rows_kept":11,"cut":false,"hidden":false,"merged":[]}
["Full name","Abbreviation","Offset","Time zone"]
["Atlantic Daylight Time","ADT","03:00:00","UTC - 3 hours"]
["Atlantic Standard Time","AST","04:00:00","UTC - 4 hours"]
["Central Daylight Time","CDT","05:00:00","UTC - 5 hours"]
["Central Standard Time","CST","06:00:00","UTC - 6 hours"]
["Eastern Daylight Time","EDT","04:00:00","UTC - 4 hours"]
{"$rows_left_out":6}
{"sheet":"Event Frequency Graphs","index":7,"n_rows":0,"n_cols":0,"rows_kept":0,"cut":false,"hidden":false,"merged":[]}

{"sheet":"Frequency Response Initiative","index":8,"n_rows":24,"n_cols":25,"rows_kept":24,"cut":false,"hidden":false,"merged":[]}
[]
[]
[null,null,null,null,null,null,null,null,null,null,null,null,null,null,null,null,null,null,null,null,null,null,null,null,"FRI - NERC Frequency Response Initiative"]
[]
[null,null,null,null,null,null,null,null,null,null,null,null,null,null,null,null,null,null,null,null,null,null,null,null,"The FRI Report made recommendations to evaluate Primary Frequency Response at additional time intervals during the event recovery period."]
[null,null,null,null,null,null,null,null,null,null,null,null,null,null,null,null,null,null,null,null,null,null,null,null,"Additional evaluations have been added to both Form 1 and Form 2 to evaluate PFR delivery for these suggested time periods."]
{"$rows_left_out":18}