{"text_format":"1","workbook":"xlsx","n_sheets":10,"sheets":["Instructions","Data Entry","BA Form 2 Event Data","FRO Data","Adjustments","BA Form 1 Results Data","TimeZone Ref","Frequency Response Initiative","Change History","Frequency Event Graphs"],"not_rendered":{"charts":7,"images":0,"macros":1,"external_links":1,"defined_names":21,"comments":0,"pivot_tables":0},"unopened":[],"bounds":{"document_bytes":16777216,"sheet_cells":100000,"rows_first":2000,"rows_last":500,"rows_between":2000,"halvings":0,"cell_chars":16384,"cell_head_chars":4096},"cells_cut":0,"cells_raw":0,"read":"whole","date_system":"1900"}

{"sheet":"Instructions","index":0,"n_rows":35,"n_cols":1,"rows_kept":35,"cut":false,"hidden":false,"merged":[[33,1,33,8],[3,1,3,8],[6,1,6,8],[10,1,10,8],[7,1,7,8]]}
["Balancing Area FRS Form 1-2018 Instructions"]
["2018-05-01"]
["Each Balancing Authority (BA) including those within a Frequency Response Sharing Group (FRSG) provides data for the determination of the appropriate Interconnection’s Resource Loss Protection Criteria (RLPC). In addition to the current practice of providing their frequency response sampling for all four quarters and their Frequency Bias Setting (FBS) calculation, each BA provides requested information regarding determination of resource losses and potential maximum resource loss due to Remedial Action Scheme (RAS) actions as detailed in the “Procedure for ERO Support of Frequency Response and Frequency Bias Setting Standard”. For BAs that do not have facilities that meet the defined criteria, the entity would enter “0” in the appropriate cell. It would be expected that “load only” BAs would not have resources to report, as well as “generation only” BAs that have only a single resource. It is also expected that most BAs would not have RAS actions that include loss of resources larger than their reported resource losses. To facilitate the collection of data, the FRS Form 1 has been modified with the addition of the following fields."]
["1.       Enter data in all green Cells on the \"BA Data Entry\" worksheet."]
["  a.       Cell E1 – Select your BA acronym from the drop-down list."]
["  b.      Cells S9 through S11 – Enter with contact information."]
{"$rows_left_out":30}
{"sheet":"Data Entry","index":1,"n_rows":68,"n_cols":56,"rows_kept":68,"cut":false,"hidden":false,"merged":[[42,16,43,16],[42,17,43,17],[21,17,22,17],[38,16,39,16],[38,17,39,17],[40,16,41,16],[27,16,27,17],[24,16,25,16],[24,17,25,17],[34,16,35,17],[36,16,37,17],[40,17,41,17],[44,16,45,16],[44,17,45,17],[0,50,0,56],[11,42,11,46],[0,19,0,20],[12,42,12,46],[23,42,23,46],[14,42,14,46],[15,42,15,46],[18,42,18,46],[19,42,19,46],[20,42,20,46],[21,42,21,46],[21,16,22,16],[33,42,33,46],[34,42,34,46],[49,42,49,46],[50,42,50,46],[47,42,47,46],[48,42,48,46],[38,42,38,46],[39,42,39,46],[44,42,44,46],[45,42,45,46],[40,42,40,46],[41,42,41,46],[42,42,42,46],[43,42,43,46],[46,42,46,46],[37,42,37,46],[27,42,27,46],[31,42,31,46],[36,42,36,46],[1,55,1,56],[2,55,2,56],[32,42,32,46],[35,42,35,46],[28,42,28,46],[13,42,13,46],[4,42,4,46],[5,42,5,46],[6,42,6,46],[7,42,7,46],[8,42,8,46],[9,42,9,46],[10,42,10,46],[29,42,29,46],[30,42,30,46],[17,42,17,46],[24,42,24,46],[25,42,25,46],[26,42,26,46],[16,42,16,46],[22,42,22,46],[0,5,0,15],[1,8,2,9],[1,10,2,11],[5,16,5,17],[20,16,20,17],[12,16,12,17],[17,16,18,16],[17,17,18,17],[15,16,16,16],[15,17,16,17],[13,16,14,16],[13,17,14,17]]}
[null,"Select Balancing Authority","AEC",null,null,{"$f":"\"NERC Eastern FRS FORM 1 - Data Entry for Operating Year \"&DataYear","v":"NERC Eastern FRS FORM 1 - Data Entry for Operating Year 2018"},null,null,null,null,null,null,null,null,null,null,"Enter Addition Data in columns V through X ==>",null,null,"Enter Load Information",null," Select Reason(s) for adjustment",null,null,null,null,null,null,null,null,null,null,null,null,null,null,null,null,null,null,null,null,null,null,null,null,null,null,null,null,"Columns BA, BB, BC, BD, BE, BF and BG are reserved for calculation of the linear regression."]
[null,"UTC (t-0)",null,"BA",null,"BA ","BA","Relay Lmt"," Value \"A\" Information",null," Value \"B\" Information",null,"SEFRD (FRM)",null,"Exclude",null,"Enter Data in Green Highlighted Cells",null,null," Value \"A\""," Value \"B\"",null,null,null,null,null,null,null,null,null,null,null,null,null,null,null,null,null,null,null,null,null,null,null,null,null,null,null,null,null,"BA Delta","10 X BA","10 X BA","SEFRDB","SEFRDR","Regression"]
["Event","Date / Time","Date/Time (t-0)","Time","B to A",null,"Bias","R1",null,null,null,null,"for Bias","for R1","for data",null,"Grey and light blue cells are calculated or set by the ERO.",null,null,null,null,null,null,null,null,null,null,null,null,null,null,null,null,null,null,null,null,null,null,null,null,null,null,null,null,null,null,null,null,null,"NAI","DelFreq","DelFreq","(MW/0.1Hz)","(MW/0.1Hz)","Statistics"]
["Number","(MM/DD/YY HH:MM:SS)","BA Time","Zone","DelFreq","Time","DelFreq","DelFreq","NAI","Adj.","NAI","Adj.","(MW/0.1Hz)","(MW/0.1Hz)","error *",{"$f":"#REF!*100","v":{"$error":"#REF!"}},null,null,null,"Load","Load","Reason(s)",null,null,null,null,null,null,null,null,null,null,null,null,null,null,null,null,null,null,null,null,null,null,null,null,null,null,null,null,null,"For Bias","For R1",null,null,"For Bias"]
[1,"2017-12-05T22:18:52",{"$f":"IF(B5=\"\",\" \",B5-LOOKUP(D5,TimeZones,'TimeZone Ref'!C$2:C$11))","v":"2017-12-05T17:18:52"},"EST",-3.9000000000001478E-2,{"$f":"'BA Form 2 Event Data'!E8","v":"00:00:00"},{"$f":"'BA Form 2 Event Data'!$U8-'BA Form 2 Event Data'!$J8","v":0},{"$f":"IF('Data Entry'!E5<0,(IF('Data Entry'!Q$7=\"Eastern\",(IF('BA Form 2 Event Data'!U8<'Data Entry'!AO$65,'Data Entry'!AO$65-'BA Form 2 Event Data'!J8,'BA Form 2 Event Data'!U8-'BA Form 2 Event Data'!J8)),(IF('BA Form 2 Event Data'!U8<'Data Entry'!AO$66,'Data Entry'!AO$66-'BA Form 2 Event Data'!J8,'BA Form 2 Event Data'!U8-'BA Form 2 Event Data'!J8)))),(IF('Data Entry'!Q$7=\"Eastern\",(IF('BA Form 2 Event Data'!U8>'Data Entry'!AP$65,'Data Entry'!AP$65-'BA Form 2 Event Data'!J8,'BA Form 2 Event Data'!U8-'BA Form 2 Event Data'!J8)),(IF('BA Form 2 Event Data'!U8>'Data Entry'!AP$66,'Data Entry'!AP$66-'BA Form 2 Event Data'!J8,'BA Form 2 Event Data'!U8-'BA Form 2 Event Data'!J8)))))","v":59.5},{"$f":"'BA Form 2 Event Data'!K8","v":0},{"$f":"IF(CELL(\"type\",Adjustments!$V4) = \"v\",(Adjustments!$D4+Adjustments!$G4+Adjustments!$J4+Adjustments!$M4+Adjustments!$P4+Adjustments!$S4),0)","v":0},{"$f":"'BA Form 2 Event Data'!V8","v":0},{"$f":"IF(CELL(\"type\",Adjustments!$V4) = \"v\",(Adjustments!$E4+Adjustments!$H4+Adjustments!$K4+Adjustments!$N4+Adjustments!$Q4+Adjustments!$T4),0)","v":0},{"$f":"IF($O5=\"y\", \"\",IF(CELL(\"type\",$G5) = \"v\",(($K5-$L5+Adjustments!$Q4)-($I5-$J5+Adjustments!$P4))/(10*$G5),\"\"))","v":{"$error":"#DIV/0!"}},{"$f":"IF($O5=\"y\", \"\",IF(CELL(\"type\",$G5) = \"v\",(($K5-$L5)-($I5-$J5))/(10*(IF(Q$7=\"Eastern\",(IF('BA Form 2 Event Data'!U8<AO$65,AO$65,IF('BA Form 2 Event Data'!U8>AP$65,AP$65,'BA Form 2 Event Data'!U8-'BA Form 2 Event Data'!J8))),(IF(Q$7=\"Western\",(IF('BA Form 2 Event Data'!U8<AO$66,AO$66,IF('BA Form 2 Event Data'!U8>AP$66,AP$66,'BA Form 2 Event Data'!U8-'BA Form 2 Event Data'!J8))),(IF(Q$7=\"ERCOT\",(IF('BA Form 2 Event Data'!U8<AO$67,AO$67,IF('BA Form 2 Event Data'!U8>AP$67,AP$67,'BA Form 2 Event Data'!U8-'BA Form 2 Event Data'!J8))),(IF('BA Form 2 Event Data'!U8<AO$68,AO$68,IF('BA Form 2 Event Data'!U8>AP$68,AP$68,'BA Form 2 Event Data'!U8-'BA Form 2 Event Data'!J8)))))))))),\"\"))","v":0},"N",{"$f":"IF($O5=\"y\", \"\",IF(CELL(\"type\",$G5) = \"v\",(($K5-$L5)-($I5-$J5)),\"\"))","v":0},null,null,null,{"$f":"'BA Form 2 Event Data'!S8","v":0},{"$f":"'BA Form 2 Event Data'!AG8","v":0},null,null,null,null,null,null,null,null,null,null,null,null,null,null,null,null,null,-5.7760692778103362E-2,23.246720631917327,null,null,"Dynamic schedules for joint-owned units (DS)",null,null,null,null,null,null,null,{"$f":" ($M5-$N5)-($K5-($L5-Adjustments!O5))","v":{"$error":"#DIV/0!"}},{"$f":" 10*$I5","v":0},null,null,null,{"$f":"LINEST(AY5:AY29,AZ5:AZ29,0,0)","v":{"$error":"#VALUE!"}}]
[2,"2017-12-06T23:27:12",{"$f":"IF(B6=\"\",\" \",B6-LOOKUP(D6,TimeZones,'TimeZone Ref'!C$2:C$11))","v":"2017-12-06T18:27:12"},"EST",-4.8000000000001819E-2,{"$f":"'BA Form 2 Event Data'!E9","v":"00:00:00"},{"$f":"'BA Form 2 Event Data'!U9-'BA Form 2 Event Data'!J9","v":0},{"$f":"IF('Data Entry'!E6<0,(IF('Data Entry'!Q$7=\"Eastern\",(IF('BA Form 2 Event Data'!U9<'Data Entry'!AO$65,'Data Entry'!AO$65-'BA Form 2 Event Data'!J9,'BA Form 2 Event Data'!U9-'BA Form 2 Event Data'!J9)),(IF('BA Form 2 Event Data'!U9<'Data Entry'!AO$66,'Data Entry'!AO$66-'BA Form 2 Event Data'!J9,'BA Form 2 Event Data'!U9-'BA Form 2 Event Data'!J9)))),(IF('Data Entry'!Q$7=\"Eastern\",(IF('BA Form 2 Event Data'!U9>'Data Entry'!AP$65,'Data Entry'!AP$65-'BA Form 2 Event Data'!J9,'BA Form 2 Event Data'!U9-'BA Form 2 Event Data'!J9)),(IF('BA Form 2 Event Data'!U9>'Data Entry'!AP$66,'Data Entry'!AP$66-'BA Form 2 Event Data'!J9,'BA Form 2 Event Data'!U9-'BA Form 2 Event Data'!J9)))))","v":59.5},{"$f":"'BA Form 2 Event Data'!K9","v":0},{"$f":"IF(CELL(\"type\",Adjustments!$V5) = \"v\",(Adjustments!$D5+Adjustments!$G5+Adjustments!$J5+Adjustments!$M5+Adjustments!$P5+Adjustments!$S5),0)","v":0},{"$f":"'BA Form 2 Event Data'!V9","v":0},{"$f":"IF(CELL(\"type\",Adjustments!$V5) = \"v\",(Adjustments!$E5+Adjustments!$H5+Adjustments!$K5+Adjustments!$N5+Adjustments!$Q5+Adjustments!$T5),0)","v":0},{"$f":"IF($O6=\"y\", \"\",IF(CELL(\"type\",$G6) = \"v\",(($K6-$L6+Adjustments!$Q5)-($I6-$J6+Adjustments!$P5))/(10*$G6),\"\"))","v":{"$error":"#DIV/0!"}},{"$f":"IF($O6=\"y\", \"\",IF(CELL(\"type\",$G6) = \"v\",(($K6-$L6)-($I6-$J6))/(10*(IF(Q$7=\"Eastern\",(IF('BA Form 2 Event Data'!U9<AO$65,AO$65,IF('BA Form 2 Event Data'!U9>AP$65,AP$65,'BA Form 2 Event Data'!U9-'BA Form 2 Event Data'!J9))),(IF(Q$7=\"Western\",(IF('BA Form 2 Event Data'!U9<AO$66,AO$66,IF('BA Form 2 Event Data'!U9>AP$66,AP$66,'BA Form 2 Event Data'!U9-'BA Form 2 Event Data'!J9))),(IF(Q$7=\"ERCOT\",(IF('BA Form 2 Event Data'!U9<AO$67,AO$67,IF('BA Form 2 Event Data'!U9>AP$67,AP$67,'BA Form 2 Event Data'!U9-'BA Form 2 Event Data'!J9))),(IF('BA Form 2 Event Data'!U9<AO$68,AO$68,IF('BA Form 2 Event Data'!U9>AP$68,AP$68,'BA Form 2 Event Data'!U9-'BA Form 2 Event Data'!J9)))))))))),\"\"))","v":0},"N",0,"BA and Contact information",null,null,{"$f":"'BA Form 2 Event Data'!S9","v":0},{"$f":"'BA Form 2 Event Data'!AG9","v":0},null,null,null,null,null,null,null,null,null,null,null,null,null,null,null,null,null,-6.609326317200015E-2,27.701624461582725,null,null,"Nonconforming load (NL)",null,null,null,null,null,null,null,{"$f":" ($M6-$N6)-($K6-($L6-Adjustments!O6))","v":{"$error":"#DIV/0!"}},{"$f":" 10*$I6","v":0}]
{"$rows_left_out":63}
{"sheet":"BA Form 2 Event Data","index":2,"n_rows":49,"n_cols":48,"rows_kept":49,"cut":false,"hidden":false,"merged":[[1,3,1,7]]}
[null,null,null,null,null,null,null,null,null,null,null,null,null,null,null,null,null,null,null,null,null,null,null,null,null,null,null,"Average P.U. Performance",{"$f":"AVERAGE(AC8:AC49)","v":{"$error":"#DIV/0!"}},{"$f":"AVERAGE(AD8:AD49)","v":{"$error":"#DIV/0!"}},{"$error":"#DIV/0!"},null,null,null,null,{"$f":"AVERAGE(AJ8:AJ49)","v":{"$error":"#DIV/0!"}},{"$error":"#DIV/0!"},{"$error":"#DIV/0!"},{"$error":"#DIV/0!"},{"$error":"#DIV/0!"},{"$error":"#DIV/0!"},{"$error":"#DIV/0!"},{"$error":"#DIV/0!"},{"$error":"#DIV/0!"},{"$error":"#DIV/0!"}]
[null,null,null,"PasteSpecial/Values the data copied from FRS Form 2 for each event.",null,null,null,null,null,"Value A Data",null,"BA Performance",null,null,null,null,null,null,null,null,"Value B","20 to 52 second Average Period Evaluation",null,null,null,null,null,null,null,null,null,null,null,null,null,"Frequency Response Initiative - Additional Primary Frequency Response Evaluation Points"]
[null,null,null,null,null,null,null,null,null,null,null,"JOU","Non-",null,null,"Transferred","Contingent",null,null,null,null,null,"JOU","Non-",null,null,"Transferred","Contingent",null,null,null,null,null,null,"Average","Unadjusted","Unadjusted","Unadjusted","Unadjusted","Unadjusted","Adjusted","Adjusted","Adjusted","Adjusted","Adjusted"]
[null,null,null,"Date","A Point","FPointA","A Value","t(0) Time","C Value",null,"Net","Dynamic","Conforming","Pumped","Ramping","Frequency","BA","BA","BA","Bias",null,"Net","Dynamic","Conforming","Pumped","Ramping","Frequency","BA","Initial","Initial","Sustained","BA","BA","Bias","Bias While","PFR","PFR","PFR","PFR","PFR","PFR","PFR","PFR","PFR","PFR"]
[null,null,null,null,"Time","Hz","Hz",null,"Hz",null,"Actual","Schedules","Load","Hydro","Units","Response","Lost Generation","Bias","Load","Setting",null,"Actual","Schedules","Load","Hydro","Units","Response","Lost Generation","Performance","Performance","Performance","Bias","Load","Setting","Hz > +/-0.036","Performance","Performance","Performance","Performance","Performance","Performance","Performance","Performance","Performance","Performance","Maximum","Minimum","Load"]
["Event","Date/Time","B-A",null,null,null,null,null,null,"Frequency","Interchange","Imp(-) Exp (+)","Load (-)","Load (-) Gen (+)","Gen (+)","Rec (-) Del (+)","Load (-) Gen (+)","Setting",null,"EPFR","Frequency","Interchange","Imp(-) Exp (+)","Load (-)","Load (-) Gen (+)","Gen (+)","Rec (-) Del (+)","Load (-) Gen (+)","Adjusted","Unadjusted",null,"Setting",null,"EPFR","Hz","@ T(+46)","@ T(+76)","@ T(+106)","@ T(+136)","@ T(+166)","@ T(+46)","@ T(+76)","@ T(+106)","@ T(+136)","@ T(+166)","Bias Setting","Bias Setting","Dampening"]
{"$rows_left_out":44}
{"sheet":"FRO Data","index":3,"n_rows":89,"n_cols":9,"rows_kept":89,"cut":false,"hidden":true,"merged":[]}
[null,null,null,null,"Operating Year 2017","IFROs"]
[null,null,null,null,"Eastern Interconnection",-1015,null,"EI e1",1.7999999999999999E-2]
[null,null,null,null,"Western Interconnection",-858,null,"EI e10",5.7000000000000002E-3]
[null,null,null,null,"ERCOT Interconnection",-381]
[null,null,null,null,"HQT Interconnection",-179,null,"WI e1",2.2800000000000001E-2]
[null,null,null,null,null,"MW/0.1 Hz",null,"WI e10",7.3000000000000001E-3]
{"$rows_left_out":84}
{"sheet":"Adjustments","index":4,"n_rows":54,"n_cols":22,"rows_kept":54,"cut":false,"hidden":false,"merged":[[47,2,47,19],[48,2,48,19],[60,2,60,19],[53,2,53,19],[54,2,54,19],[55,2,55,19],[56,2,56,19],[57,2,57,19],[58,2,58,19],[49,2,49,19],[50,2,50,19],[51,2,51,19],[59,2,59,19],[52,2,52,19],[1,11,2,11],[1,14,2,14],[1,17,2,17],[1,21,2,21],[45,1,45,2],[45,3,45,4],[45,6,45,7],[45,9,45,10],[45,12,45,13],[45,18,45,19],[1,5,2,5],[1,8,2,8],[1,20,2,20],[0,3,0,4],[0,6,0,7],[0,9,0,10],[0,12,0,13],[0,18,0,19]]}
[null,{"$f":"'Data Entry'!#REF!","v":{"$error":"#REF!"}},{"$f":"'Data Entry'!$C$1","v":"AEC"},"JOU \nDynamic Schedules",null,null,"Non conforming Load",null,null,"Pumped Hydro",null,null,"Not Used",null,null,"Transferred Frequency Response",null,null,"Contingent BA Adjustment",null,null,"Net Total Adjustments"]
["Event",{"$f":"'Data Entry'!C3","v":"Date/Time (t-0)"},null,"Value A","Value B",null,"Value A","Value B",null,"Value A","Value B",null,"Value A","Value B",null,"Value A","Value B",null,"Value A","Value B",null,"Value B 20 to 52 seconds"]
["Number",{"$f":"'Data Entry'!C4","v":"BA Time"},{"$f":"'Data Entry'!$E$4","v":"DelFreq"},"Adjustment","Adjustment",null,"Adjustment","Adjustment",null,"Adjustment","Adjustment",null,"Adjustment","Adjustment",null,"Adjustment","Adjustment",null,"Adjustment","Adjustment"]
[1,{"$f":"IF(CELL(\"type\",'Data Entry'!$C5) = \"v\",'Data Entry'!$C5,\"\")","v":"2017-12-05T17:18:52"},{"$f":"IF(CELL(\"type\",'Data Entry'!$E5)=\"v\",'Data Entry'!$E5,\"\")","v":-3.9000000000001478E-2},{"$f":"'BA Form 2 Event Data'!L8","v":0},{"$f":"'BA Form 2 Event Data'!W8","v":0},null,{"$f":"'BA Form 2 Event Data'!M8","v":0},{"$f":"'BA Form 2 Event Data'!X8","v":0},null,{"$f":"'BA Form 2 Event Data'!N8","v":0},{"$f":"'BA Form 2 Event Data'!Y8","v":0},null,{"$f":"'BA Form 2 Event Data'!O8","v":0},{"$f":"'BA Form 2 Event Data'!Z8","v":0},null,{"$f":"'BA Form 2 Event Data'!P8","v":0},{"$f":"'BA Form 2 Event Data'!AA8","v":0},null,{"$f":"'BA Form 2 Event Data'!Q8","v":0},{"$f":"'BA Form 2 Event Data'!AB8","v":0},null,{"$f":"IF(CELL(\"type\",'Data Entry'!$G5) = \"v\",((E4+H4+K4+N4+Q4+T4)-(D4+G4+J4+M4+P4+S4)),\"\")","v":0}]
[2,{"$f":"IF(CELL(\"type\",'Data Entry'!$C6) = \"v\",'Data Entry'!$C6,\"\")","v":"2017-12-06T18:27:12"},{"$f":"IF(CELL(\"type\",'Data Entry'!$E6)=\"v\",'Data Entry'!$E6,\"\")","v":-4.8000000000001819E-2},{"$f":"'BA Form 2 Event Data'!L9","v":0},{"$f":"'BA Form 2 Event Data'!W9","v":0},null,{"$f":"'BA Form 2 Event Data'!M9","v":0},{"$f":"'BA Form 2 Event Data'!X9","v":0},null,{"$f":"'BA Form 2 Event Data'!N9","v":0},{"$f":"'BA Form 2 Event Data'!Y9","v":0},null,{"$f":"'BA Form 2 Event Data'!O9","v":0},{"$f":"'BA Form 2 Event Data'!Z9","v":0},null,{"$f":"'BA Form 2 Event Data'!P9","v":0},{"$f":"'BA Form 2 Event Data'!AA9","v":0},null,{"$f":"'BA Form 2 Event Data'!Q9","v":0},{"$f":"'BA Form 2 Event Data'!AB9","v":0},null,{"$f":"IF(CELL(\"type\",'Data Entry'!$G6) = \"v\",((E5+H5+K5+N5+Q5+T5)-(D5+G5+J5+M5+P5+S5)),\"\")","v":0}]
[3,{"$f":"IF(CELL(\"type\",'Data Entry'!$C7) = \"v\",'Data Entry'!$C7,\"\")","v":"2017-12-11T08:58:57"},{"$f":"IF(CELL(\"type\",'Data Entry'!$E7)=\"v\",'Data Entry'!$E7,\"\")","v":-5.1999999999999602E-2},{"$f":"'BA Form 2 Event Data'!L10","v":0},{"$f":"'BA Form 2 Event Data'!W10","v":0},null,{"$f":"'BA Form 2 Event Data'!M10","v":0},{"$f":"'BA Form 2 Event Data'!X10","v":0},null,{"$f":"'BA Form 2 Event Data'!N10","v":0},{"$f":"'BA Form 2 Event Data'!Y10","v":0},null,{"$f":"'BA Form 2 Event Data'!O10","v":0},{"$f":"'BA Form 2 Event Data'!Z10","v":0},null,{"$f":"'BA Form 2 Event Data'!P10","v":0},{"$f":"'BA Form 2 Event Data'!AA10","v":0},null,{"$f":"'BA Form 2 Event Data'!Q10","v":0},{"$f":"'BA Form 2 Event Data'!AB10","v":0},null,{"$f":"IF(CELL(\"type\",'Data Entry'!$G7) = \"v\",((E6+H6+K6+N6+Q6+T6)-(D6+G6+J6+M6+P6+S6)),\"\")","v":0}]
{"$rows_left_out":49}
{"sheet":"BA Form 1 Results Data","index":5,"n_rows":2,"n_cols":6,"rows_kept":2,"cut":false,"hidden":false,"merged":[]}
["Balancing Authority","Interconnection","Operating Year","FRO","Avg FRM for R1","Median FRM for R1"]
[{"$f":"'Data Entry'!Q29","v":"AEC"},{"$f":"Interconnection","v":"Eastern"},{"$f":"DataYear","v":2018},{"$f":"FRO","v":-2},{"$f":"'Data Entry'!Q25","v":0},{"$f":"FRMr1","v":0}]

{"sheet":"TimeZone Ref","index":6,"n_rows":11,"n_cols":4,"rows_kept":11,"cut":false,"hidden":true,"merged":[]}
["Full name","Abbreviation","Offset","Time zone"]
["Atlantic Daylight Time","ADT","03:00:00","UTC - 3 hours"]
["Atlantic Standard Time","AST","04:00:00","UTC - 4 hours"]
["Central Daylight Time","CDT","05:00:00","UTC - 5 hours"]
["Central Standard Time","CST","06:00:00","UTC - 6 hours"]
["Eastern Daylight Time","EDT","04:00:00","UTC - 4 hours"]
{"$rows_left_out":6}
{"sheet":"Frequency Response Initiative","index":7,"n_rows":24,"n_cols":25,"rows_kept":24,"cut":false,"hidden":true,"merged":[]}
[]
[]
[null,null,null,null,null,null,null,null,null,null,null,null,null,null,null,null,null,null,null,null,null,null,null,null,"FRI - NERC Frequency Response Initiative"]
[]
[null,null,null,null,null,null,null,null,null,null,null,null,null,null,null,null,null,null,null,null,null,null,null,null,"The FRI Report made recommendations to evaluate Primary Frequency Response at additional time intervals during the event recovery period."]
[null,null,null,null,null,null,null,null,null,null,null,null,null,null,null,null,null,null,null,null,null,null,null,null,"Additional evaluations have been added to both Form 1 and Form 2 to evaluate PFR delivery for these suggested time periods."]
{"$rows_left_out":19}
{"sheet":"Change History","index":8,"n_rows":33,"n_cols":3,"rows_kept":33,"cut":false,"hidden":false,"merged":[]}
["Date","Worksheet","Change"]
[]
["2014-11-17","Variable Bias Supplemental Info","Fixed the calculation of the Average Annual Bias for the \"Time weighted average FBS\""]
[null,null,"Fixed the calculation of the Average Annual Bias for the \"Time weighted minimum average FBS\""]
[null,null,"Fixed K4 typo: \"If not now enter zero.\""]
[null,null,"Fixed A3 typo: \"Feburary\""]
{"$rows_left_out":28}
{"sheet":"Frequency Event Graphs","index":9,"n_rows":0,"n_cols":0,"rows_kept":0,"cut":false,"hidden":true,"merged":[]}